{"text_format":"1","workbook":"xlsx","n_sheets":5,"sheets":["Esercizio","brontolo","Canapone","Canapone ver2","Mister_x"],"not_rendered":{"charts":0,"images":0,"macros":1,"external_links":0,"defined_names":4,"comments":0,"pivot_tables":0},"unopened":[],"bounds":{"document_bytes":16777216,"sheet_cells":100000,"rows_first":2000,"rows_last":500,"rows_between":2000,"halvings":0,"cell_chars":16384,"cell_head_chars":4096},"cells_cut":0,"cells_raw":0,"read":"whole","date_system":"1900"}

{"sheet":"Esercizio","index":0,"n_rows":40,"n_cols":26,"rows_kept":40,"cut":false,"hidden":false,"merged":[[15,16,15,25],[22,20,23,20]]}
[null,null,null,"RENDICONTO ORE DI STRAORDINARIO PAGATE NEL 2014 SUDDIVISE PER MESE E PER CITTA'"]
[null,null,"Città","Gennaio","Febbraio","Marzo","Aprile","Maggio","Giugno","Luglio","Agosto","Settembre","Ottobre","Novembre","Dicembre"]
[null,null,"Ancona",338,267,232,336,256,186,247,327,156,179,172,192]
[null,null,"Arezzo",257,211,319,257,309,219,323,200,225,297,238,188]
[null,null,"Bari",252,211,178,181,342,162,337,273,263,243,303,203]
[null,null,"Bergamo",154,338,233,221,217,286,204,252,315,247,269,205]
[null,null,"Bologna",318,342,268,159,195,200,266,197,187,317,346,173]
[null,null,"Brescia",238,250,179,237,235,332,285,261,179,308,299,273]
[null,null,"Cagliari",170,300,305,311,324,251,231,325,229,260,299,191]
[null,null,"Catania",254,268,232,243,311,307,234,308,298,346,328,258]
[null,null,"Cesena",339,299,337,242,238,225,323,203,246,232,232,272]
[null,null,"Ferrara",281,307,202,253,284,165,276,310,158,318,342,182]
[null,null,"Firenze",283,218,181,301,219,164,262,288,302,253,287,312,null,"Valore Max :",{"$f":"MAX(dati)","v":350}]
[null,null,"Foggia",213,171,267,347,209,284,286,318,245,190,173,230]
[null,null,"Forlì",256,270,348,181,327,307,172,273,226,189,319,231]
[null,null,"Livorno",160,329,335,243,208,294,181,259,328,177,197,314,null,"IL COMPLESSO DELLE SOLUZIONI PROPOSTE"]
[null,null,"Messina",285,321,219,267,151,282,187,289,182,186,295,347,null,"brontolo","Canapone","Canapone","Canapone","Canapone","Luca73","ninai","scossa","scossa","Textomb"]
[null,null,"Modena",261,289,236,318,330,306,330,260,151,332,305,337]
[null,null,"Monza",318,333,166,277,158,280,294,159,167,312,332,314,null,{"$f":"INDEX($C$3:$C$40,_xlfn.AGGREGATE(15,6,ROW($C$3:$C$40)-2/($D$3:$O$40=MAX($D$3:$O$40)),ROW(A1)))","v":"Padova"},{"$f":"INDEX(C3:C40,_xlfn.AGGREGATE(14,6,ROW(1:38)/((D3:O40)=MAX(D3:O40)),1))","v":"Padova"},{"$f":"INDEX(C1:C40,MAX(INDEX(ROW(D3:D40)*((D3:O40)=MAX(D3:O40)),)))","v":"Padova"},{"$f":"IFERROR(INDEX($C$3:$C$40,SMALL(IF($D$3:$O$40=$R$13,ROW($A$3:$A$40)-2),ROW(A1))),\"\")","v":"Padova"},{"$f":"IF(ROW($A1)>COUNTIF($D$3:$O$40,$R$13),\"\",INDEX($C$3:$C$40,SMALL(IF($D$3:$O$40=$R$13,ROW($A$3:$A$40)-2),ROW(A1))))","v":"Padova"},{"$f":"INDIRECT(\"C\" & SUM(IF(D3:O40=$R$13,ROW(D3:O40),0)))","v":"Padova"},{"$f":"INDIRECT(\"C\" & SUM(INDEX((D3:O40=$R$13)*ROW(D3:O40),)))","v":"Padova"},{"$f":"OFFSET(C1,MAX(INDEX(($D$3:$O$40=$R$13)*ROW($D$3:$O$40),))-1,0)","v":"Padova"},{"$f":"OFFSET(C1,LARGE(iRig,IG)-1,0)","v":"Padova"},{"$f":"INDEX(C3:C40,MAX((ROW(C3:C40)-ROW(C2))*((D3:O40)=MAX(D3:O40))))","v":"Padova"}]
[null,null,"Napoli",340,275,227,343,154,243,175,203,233,257,265,213,null,{"$f":"INDEX($D$2:$O$2,SMALL(IF($D$3:$O$40=MAX($D$3:$O$40),COLUMN($A$1:$L$1)),COLUMNS($A1:A$1)))","v":"Agosto"},{"$f":"INDEX(D2:O2,_xlfn.AGGREGATE(15,6,COLUMN(A:L)/((D3:O40)=MAX(D3:O40)),1))","v":"Agosto"},{"$f":"INDEX(A2:O2,MAX(INDEX(COLUMN(D3:O40)*((D3:O40)=MAX(D3:O40)),)))","v":"Agosto"},{"$f":"IFERROR(SMALL(IF(INDEX($D$3:$O$40,MATCH(T19,$C$3:$C$40,0),0)=$R$13,COLUMN($D$1:$O$1)-3),COUNTIF($T$19:T19,T19)),\"\")","v":8},{"$f":"IF(U19>\"\",SMALL(IF(INDEX($D$3:$O$40,MATCH(U19,$C$3:$C$40,0),0)=$R$13,COLUMN($D$1:$O$1)-3),COUNTIF($U$19:U19,U19)),\"\")","v":8},{"$f":"OFFSET(C2,0,SUMPRODUCT(IF(D3:O40=MAX(D3:O40),COLUMN(D3:O40),0))-3)","v":"Agosto"},{"$f":"INDIRECT(\"R2C\" & SUM(INDEX((D3:O40=$R$13)*COLUMN(D3:O40),)),FALSE)","v":"Agosto"},{"$f":"OFFSET(A2,0,MAX(INDEX(($D$3:$O$40=$R$13)*COLUMN($D$3:$O$40),))-1)","v":"Agosto"},{"$f":"OFFSET(A2,0,LARGE(iCol,IG)-1)","v":"Agosto"},{"$f":"INDEX(D2:O2,MAX((COLUMN(D2:O2)-COLUMN(C2))*((D3:O40)=MAX(D3:O40))))","v":"Agosto"}]
[null,null,"Novara",295,265,194,180,156,230,289,328,261,159,243,171]
[null,null,"Padova",349,313,197,321,174,231,182,350,281,167,313,296]
[null,null,"Palermo",253,215,185,282,184,324,335,290,325,291,191,272,null,null,null,null,null,"MATRICIALI"]
[null,null,"Parma",215,253,291,196,329,332,245,277,157,346,205,175]
[null,null,"Pescara",222,271,234,283,320,252,170,214,255,305,168,321]
[null,null,"Piacenza",315,191,214,331,339,309,179,245,326,200,345,310]
[null,null,"Prato",234,164,305,328,312,206,260,202,209,316,322,155]
[null,null,"Reggio Emilia",291,274,229,221,295,186,180,250,344,180,262,321]
[null,null,"Rimini",324,193,156,266,174,160,191,178,201,349,316,248]
[null,null,"Roma",221,305,254,205,293,168,233,200,228,150,177,336]
[null,null,"Salerno",286,152,228,231,342,256,210,297,151,300,236,311]
[null,null,"Sassari",310,160,161,288,281,338,186,186,282,168,227,221]
[null,null,"Taranto",184,347,230,193,314,253,232,346,260,264,294,333]
[null,null,"Torino",336,237,210,171,319,344,170,167,158,159,323,288]
[null,null,"Trento",206,342,188,302,202,233,280,190,264,298,254,248]
[null,null,"Trieste",225,211,180,311,199,236,310,170,281,247,233,284]
[null,null,"Udine",168,221,311,238,302,291,241,152,193,210,298,244]
[null,null,"Venezia",333,214,343,276,229,260,273,165,157,244,261,243]
[null,null,"Verona",275,168,208,182,243,316,183,328,243,241,314,319]
[null,null,"Vicenza",181,239,257,255,305,255,194,298,178,274,183,291]

{"sheet":"brontolo","index":1,"n_rows":40,"n_cols":19,"rows_kept":40,"cut":false,"hidden":false,"merged":[]}
[null,null,null,"RENDICONTO ORE DI STRAORDINARIO PAGATE NEL 2014 SUDDIVISE PER MESE E PER CITTA'",null,null,null,null,null,null,null,null,null,null,null,null,"Città"]
[null,null,"Città","Gennaio","Febbraio","Marzo","Aprile","Maggio","Giugno","Luglio","Agosto","Settembre","Ottobre","Novembre","Dicembre",null,2000,2013,"Mese"]
[null,null,"Ancona",338,267,232,336,1,186,247,327,156,179,172,1,null,{"$f":"IF(ISERROR(INDEX($C$3:$C$40,_xlfn.AGGREGATE(15,6,ROW($C$3:$C$40)-2/($D$3:$O$40=MAX($D$3:$O$40)),ROW(A1))))=TRUE,\"\",INDEX($C$3:$C$40,_xlfn.AGGREGATE(15,6,ROW($C$3:$C$40)-2/($D$3:$O$40=MAX($D$3:$O$40)),ROW(A1))))","v":"Bergamo"},{"$f":"IFERROR(INDEX($C$3:$C$40,_xlfn.AGGREGATE(15,6,ROW($C$3:$C$40)-2/($D$3:$O$40=MAX($D$3:$O$40)),ROW(A1))),\"\")","v":"Bergamo"},{"$f":"IFERROR(VLOOKUP($C$2,$C$2:$O$2,IFERROR(SMALL(IF(INDEX($D$3:$O$40,MATCH(R3,$C$3:$C$40,0),0)=MAX($D$3:$O$40),COLUMN($D$1:$O$1)-2),COUNTIF($R$3:R3,R3)),\"\"),0),\"\")","v":"Novembre"}]
[null,null,"Arezzo",257,211,319,257,309,219,323,200,225,297,238,188,null,{"$f":"IF(ISERROR(INDEX($C$3:$C$40,_xlfn.AGGREGATE(15,6,ROW($C$3:$C$40)-2/($D$3:$O$40=MAX($D$3:$O$40)),ROW(A2))))=TRUE,\"\",INDEX($C$3:$C$40,_xlfn.AGGREGATE(15,6,ROW($C$3:$C$40)-2/($D$3:$O$40=MAX($D$3:$O$40)),ROW(A2))))","v":"Cagliari"},{"$f":"IFERROR(INDEX($C$3:$C$40,_xlfn.AGGREGATE(15,6,ROW($C$3:$C$40)-2/($D$3:$O$40=MAX($D$3:$O$40)),ROW(A2))),\"\")","v":"Cagliari"},{"$f":"IFERROR(VLOOKUP($C$2,$C$2:$O$2,IFERROR(SMALL(IF(INDEX($D$3:$O$40,MATCH(R4,$C$3:$C$40,0),0)=MAX($D$3:$O$40),COLUMN($D$1:$O$1)-2),COUNTIF($R$3:R4,R4)),\"\"),0),\"\")","v":"Gennaio"}]
[null,null,"Bari",252,211,178,181,342,162,337,273,263,243,303,203,null,"Cagliari","Cagliari",{"$f":"IFERROR(VLOOKUP($C$2,$C$2:$O$2,IFERROR(SMALL(IF(INDEX($D$3:$O$40,MATCH(R5,$C$3:$C$40,0),0)=MAX($D$3:$O$40),COLUMN($D$1:$O$1)-2),COUNTIF($R$3:R5,R5)),\"\"),0),\"\")","v":"Febbraio"}]
[null,null,"Bergamo",154,338,233,221,217,286,204,252,315,247,350,205,null,"Catania","Catania",{"$f":"IFERROR(VLOOKUP($C$2,$C$2:$O$2,IFERROR(SMALL(IF(INDEX($D$3:$O$40,MATCH(R6,$C$3:$C$40,0),0)=MAX($D$3:$O$40),COLUMN($D$1:$O$1)-2),COUNTIF($R$3:R6,R6)),\"\"),0),\"\")","v":"Gennaio"}]
[null,null,"Bologna",318,342,268,159,195,200,266,197,187,317,346,173,null,"Catania","Catania",{"$f":"IFERROR(VLOOKUP($C$2,$C$2:$O$2,IFERROR(SMALL(IF(INDEX($D$3:$O$40,MATCH(R7,$C$3:$C$40,0),0)=MAX($D$3:$O$40),COLUMN($D$1:$O$1)-2),COUNTIF($R$3:R7,R7)),\"\"),0),\"\")","v":"Agosto"}]
[null,null,"Brescia",238,250,179,237,235,332,285,261,179,308,299,273,null,"Catania","Catania",{"$f":"IFERROR(VLOOKUP($C$2,$C$2:$O$2,IFERROR(SMALL(IF(INDEX($D$3:$O$40,MATCH(R8,$C$3:$C$40,0),0)=MAX($D$3:$O$40),COLUMN($D$1:$O$1)-2),COUNTIF($R$3:R8,R8)),\"\"),0),\"\")","v":"Novembre"}]
[null,null,"Cagliari",350,350,305,311,324,251,231,325,229,260,299,191,null,"Modena","Modena",{"$f":"IFERROR(VLOOKUP($C$2,$C$2:$O$2,IFERROR(SMALL(IF(INDEX($D$3:$O$40,MATCH(R9,$C$3:$C$40,0),0)=MAX($D$3:$O$40),COLUMN($D$1:$O$1)-2),COUNTIF($R$3:R9,R9)),\"\"),0),\"\")","v":"Aprile"}]
[null,null,"Catania",350,111,232,243,311,307,234,350,298,346,350,258,null,"Padova","Padova",{"$f":"IFERROR(VLOOKUP($C$2,$C$2:$O$2,IFERROR(SMALL(IF(INDEX($D$3:$O$40,MATCH(R10,$C$3:$C$40,0),0)=MAX($D$3:$O$40),COLUMN($D$1:$O$1)-2),COUNTIF($R$3:R10,R10)),\"\"),0),\"\")","v":"Agosto"}]
[null,null,"Cesena",339,299,337,242,238,225,323,203,246,232,232,272,null,"","",{"$f":"IFERROR(VLOOKUP($C$2,$C$2:$O$2,IFERROR(SMALL(IF(INDEX($D$3:$O$40,MATCH(R11,$C$3:$C$40,0),0)=MAX($D$3:$O$40),COLUMN($D$1:$O$1)-2),COUNTIF($R$3:R11,R11)),\"\"),0),\"\")","v":""}]
[null,null,"Ferrara",281,307,202,253,284,165,276,310,158,318,342,182,null,"","",{"$f":"IFERROR(VLOOKUP($C$2,$C$2:$O$2,IFERROR(SMALL(IF(INDEX($D$3:$O$40,MATCH(R12,$C$3:$C$40,0),0)=MAX($D$3:$O$40),COLUMN($D$1:$O$1)-2),COUNTIF($R$3:R12,R12)),\"\"),0),\"\")","v":""}]
[null,null,"Firenze",283,218,181,301,219,164,262,288,302,253,287,312,null,"","",{"$f":"IFERROR(VLOOKUP($C$2,$C$2:$O$2,IFERROR(SMALL(IF(INDEX($D$3:$O$40,MATCH(R13,$C$3:$C$40,0),0)=MAX($D$3:$O$40),COLUMN($D$1:$O$1)-2),COUNTIF($R$3:R13,R13)),\"\"),0),\"\")","v":""}]
[null,null,"Foggia",213,171,267,347,209,284,286,318,245,190,173,230,null,"","",{"$f":"IFERROR(VLOOKUP($C$2,$C$2:$O$2,IFERROR(SMALL(IF(INDEX($D$3:$O$40,MATCH(R14,$C$3:$C$40,0),0)=MAX($D$3:$O$40),COLUMN($D$1:$O$1)-2),COUNTIF($R$3:R14,R14)),\"\"),0),\"\")","v":""}]
[null,null,"Forlì",256,270,348,181,327,307,172,273,226,189,319,231,null,"","",{"$f":"IFERROR(VLOOKUP($C$2,$C$2:$O$2,IFERROR(SMALL(IF(INDEX($D$3:$O$40,MATCH(R15,$C$3:$C$40,0),0)=MAX($D$3:$O$40),COLUMN($D$1:$O$1)-2),COUNTIF($R$3:R15,R15)),\"\"),0),\"\")","v":""}]
[null,null,"Livorno",160,329,335,243,208,294,181,259,328,177,197,314,null,"","",{"$f":"IFERROR(VLOOKUP($C$2,$C$2:$O$2,IFERROR(SMALL(IF(INDEX($D$3:$O$40,MATCH(R16,$C$3:$C$40,0),0)=MAX($D$3:$O$40),COLUMN($D$1:$O$1)-2),COUNTIF($R$3:R16,R16)),\"\"),0),\"\")","v":""}]
[null,null,"Messina",285,321,219,267,151,282,187,289,182,186,295,347,null,"","",{"$f":"IFERROR(VLOOKUP($C$2,$C$2:$O$2,IFERROR(SMALL(IF(INDEX($D$3:$O$40,MATCH(R17,$C$3:$C$40,0),0)=MAX($D$3:$O$40),COLUMN($D$1:$O$1)-2),COUNTIF($R$3:R17,R17)),\"\"),0),\"\")","v":""}]
[null,null,"Modena",261,289,236,350,330,306,330,260,151,332,305,337,null,"","",{"$f":"IFERROR(VLOOKUP($C$2,$C$2:$O$2,IFERROR(SMALL(IF(INDEX($D$3:$O$40,MATCH(R18,$C$3:$C$40,0),0)=MAX($D$3:$O$40),COLUMN($D$1:$O$1)-2),COUNTIF($R$3:R18,R18)),\"\"),0),\"\")","v":""}]
[null,null,"Monza",318,333,166,277,158,280,294,159,167,312,332,314]
[null,null,"Napoli",340,275,227,343,154,243,175,203,233,257,265,213]
[null,null,"Novara",295,265,194,180,156,230,289,328,261,159,243,171]
[null,null,"Padova",349,313,197,321,174,231,182,350,281,167,313,0]
[null,null,"Palermo",253,215,185,282,184,324,335,290,325,291,191,272]
[null,null,"Parma",215,253,291,196,329,332,245,277,157,346,205,175]
[null,null,"Pescara",222,271,234,283,320,252,170,214,255,305,168,321]
[null,null,"Piacenza",315,191,214,331,339,309,179,245,326,200,345,310]
[null,null,"Prato",234,164,305,328,312,206,260,202,209,316,322,155]
[null,null,"Reggio Emilia",291,274,229,221,295,186,180,250,344,180,262,321]
[null,null,"Rimini",324,193,156,266,174,160,191,178,201,349,316,248]
[null,null,"Roma",221,305,254,205,293,168,233,200,228,150,177,336]
[null,null,"Salerno",286,152,228,231,342,256,210,297,151,300,236,311]
[null,null,"Sassari",310,160,161,288,281,338,186,186,282,168,227,221]
[null,null,"Taranto",184,347,230,193,314,253,232,346,260,264,294,333]
[null,null,"Torino",336,237,210,171,319,344,170,167,158,159,323,288]
[null,null,"Trento",206,342,188,302,202,233,280,190,264,298,254,248]
[null,null,"Trieste",225,211,180,311,199,236,310,170,281,247,233,284]
[null,null,"Udine",168,221,311,238,302,291,241,152,193,210,298,244]
[null,null,"Venezia",333,214,343,276,229,260,273,165,157,244,261,243]
[null,null,"Verona",275,168,208,182,243,316,183,328,243,241,314,319]
[null,null,"Vicenza",181,239,257,255,305,255,194,298,178,274,183,291]

{"sheet":"Canapone","index":2,"n_rows":40,"n_cols":18,"rows_kept":40,"cut":false,"hidden":false,"merged":[]}
[null,null,null,"RENDICONTO ORE DI STRAORDINARIO PAGATE NEL 2014 SUDDIVISE PER MESE E PER CITTA'"]
[null,null,"Città","Gennaio","Febbraio","Marzo","Aprile","Maggio","Giugno","Luglio","Agosto","Settembre","Ottobre","Novembre","Dicembre"]
[null,null,"Ancona",338,267,232,336,1,186,247,327,156,179,172,1]
[null,null,"Arezzo",257,211,319,257,309,219,323,200,225,297,238,188]
[null,null,"Bari",252,211,178,181,342,162,337,273,263,243,303,203]
[null,null,"Bergamo",154,338,233,221,217,286,204,252,315,247,350,205]
[null,null,"Bologna",318,342,268,159,195,200,266,197,187,317,346,173]
[null,null,"Brescia",238,250,179,237,235,332,285,261,179,308,299,273]
[null,null,"Cagliari",350,350,305,311,324,251,231,325,229,260,299,191]
[null,null,"Catania",350,111,232,243,311,307,234,350,298,346,350,258]
[null,null,"Cesena",339,299,337,242,238,225,323,203,246,232,232,272]
[null,null,"Ferrara",281,307,202,253,284,165,276,310,158,318,342,182]
[null,null,"Firenze",283,218,181,301,219,164,262,288,302,253,287,312,null,"Valore Max :",{"$f":"MAX(D3:O40)","v":350}]
[null,null,"Foggia",213,171,267,347,209,284,286,318,245,190,173,230]
[null,null,"Forlì",256,270,348,181,327,307,172,273,226,189,319,231,null,{"$f":"IFERROR(INDEX($C$3:$C$40,SMALL(IF($D$3:$O$40=$R$13,ROW($A$3:$A$40)-2),ROW(A1))),\"\")","v":"Bergamo"},{"$f":"IFERROR(SMALL(IF(INDEX($D$3:$O$40,MATCH(Q15,$C$3:$C$40,0),0)=$R$13,COLUMN($D$1:$O$1)-3),COUNTIF($Q$15:Q15,Q15)),\"\")","v":11}]
[null,null,"Livorno",160,329,335,243,208,294,181,259,328,177,197,314,null,{"$f":"IFERROR(INDEX($C$3:$C$40,SMALL(IF($D$3:$O$40=$R$13,ROW($A$3:$A$40)-2),ROW(A2))),\"\")","v":"Cagliari"},{"$f":"IFERROR(SMALL(IF(INDEX($D$3:$O$40,MATCH(Q16,$C$3:$C$40,0),0)=$R$13,COLUMN($D$1:$O$1)-3),COUNTIF($Q$15:Q16,Q16)),\"\")","v":1}]
[null,null,"Messina",285,321,219,267,151,282,187,289,182,186,295,347,null,{"$f":"IFERROR(INDEX($C$3:$C$40,SMALL(IF($D$3:$O$40=$R$13,ROW($A$3:$A$40)-2),ROW(A3))),\"\")","v":"Cagliari"},{"$f":"IFERROR(SMALL(IF(INDEX($D$3:$O$40,MATCH(Q17,$C$3:$C$40,0),0)=$R$13,COLUMN($D$1:$O$1)-3),COUNTIF($Q$15:Q17,Q17)),\"\")","v":2}]
[null,null,"Modena",261,289,236,350,330,306,330,260,151,332,305,337,null,{"$f":"IFERROR(INDEX($C$3:$C$40,SMALL(IF($D$3:$O$40=$R$13,ROW($A$3:$A$40)-2),ROW(A4))),\"\")","v":"Catania"},{"$f":"IFERROR(SMALL(IF(INDEX($D$3:$O$40,MATCH(Q18,$C$3:$C$40,0),0)=$R$13,COLUMN($D$1:$O$1)-3),COUNTIF($Q$15:Q18,Q18)),\"\")","v":1}]
[null,null,"Monza",318,333,166,277,158,280,294,159,167,312,332,314,null,{"$f":"IFERROR(INDEX($C$3:$C$40,SMALL(IF($D$3:$O$40=$R$13,ROW($A$3:$A$40)-2),ROW(A5))),\"\")","v":"Catania"},{"$f":"IFERROR(SMALL(IF(INDEX($D$3:$O$40,MATCH(Q19,$C$3:$C$40,0),0)=$R$13,COLUMN($D$1:$O$1)-3),COUNTIF($Q$15:Q19,Q19)),\"\")","v":8}]
[null,null,"Napoli",340,275,227,343,154,243,175,203,233,257,265,213,null,{"$f":"IFERROR(INDEX($C$3:$C$40,SMALL(IF($D$3:$O$40=$R$13,ROW($A$3:$A$40)-2),ROW(A6))),\"\")","v":"Catania"},{"$f":"IFERROR(SMALL(IF(INDEX($D$3:$O$40,MATCH(Q20,$C$3:$C$40,0),0)=$R$13,COLUMN($D$1:$O$1)-3),COUNTIF($Q$15:Q20,Q20)),\"\")","v":11}]
[null,null,"Novara",295,265,194,180,156,230,289,328,261,159,243,171,null,{"$f":"IFERROR(INDEX($C$3:$C$40,SMALL(IF($D$3:$O$40=$R$13,ROW($A$3:$A$40)-2),ROW(A7))),\"\")","v":"Modena"},{"$f":"IFERROR(SMALL(IF(INDEX($D$3:$O$40,MATCH(Q21,$C$3:$C$40,0),0)=$R$13,COLUMN($D$1:$O$1)-3),COUNTIF($Q$15:Q21,Q21)),\"\")","v":4}]
[null,null,"Padova",349,313,197,321,174,231,182,350,281,167,313,0,null,{"$f":"IFERROR(INDEX($C$3:$C$40,SMALL(IF($D$3:$O$40=$R$13,ROW($A$3:$A$40)-2),ROW(A8))),\"\")","v":"Padova"},{"$f":"IFERROR(SMALL(IF(INDEX($D$3:$O$40,MATCH(Q22,$C$3:$C$40,0),0)=$R$13,COLUMN($D$1:$O$1)-3),COUNTIF($Q$15:Q22,Q22)),\"\")","v":8}]
[null,null,"Palermo",253,215,185,282,184,324,335,290,325,291,191,272,null,{"$f":"IFERROR(INDEX($C$3:$C$40,SMALL(IF($D$3:$O$40=$R$13,ROW($A$3:$A$40)-2),ROW(A9))),\"\")","v":""},{"$f":"IFERROR(SMALL(IF(INDEX($D$3:$O$40,MATCH(Q23,$C$3:$C$40,0),0)=$R$13,COLUMN($D$1:$O$1)-3),COUNTIF($Q$15:Q23,Q23)),\"\")","v":""}]
[null,null,"Parma",215,253,291,196,329,332,245,277,157,346,205,175,null,{"$f":"IFERROR(INDEX($C$3:$C$40,SMALL(IF($D$3:$O$40=$R$13,ROW($A$3:$A$40)-2),ROW(A10))),\"\")","v":""},{"$f":"IFERROR(SMALL(IF(INDEX($D$3:$O$40,MATCH(Q24,$C$3:$C$40,0),0)=$R$13,COLUMN($D$1:$O$1)-3),COUNTIF($Q$15:Q24,Q24)),\"\")","v":""}]
[null,null,"Pescara",222,271,234,283,320,252,170,214,255,305,168,321,null,{"$f":"IFERROR(INDEX($C$3:$C$40,SMALL(IF($D$3:$O$40=$R$13,ROW($A$3:$A$40)-2),ROW(A11))),\"\")","v":""},{"$f":"IFERROR(SMALL(IF(INDEX($D$3:$O$40,MATCH(Q25,$C$3:$C$40,0),0)=$R$13,COLUMN($D$1:$O$1)-3),COUNTIF($Q$15:Q25,Q25)),\"\")","v":""}]
[null,null,"Piacenza",315,191,214,331,339,309,179,245,326,200,345,310]
[null,null,"Prato",234,164,305,328,312,206,260,202,209,316,322,155]
[null,null,"Reggio Emilia",291,274,229,221,295,186,180,250,344,180,262,321]
[null,null,"Rimini",324,193,156,266,174,160,191,178,201,349,316,248]
[null,null,"Roma",221,305,254,205,293,168,233,200,228,150,177,336]
[null,null,"Salerno",286,152,228,231,342,256,210,297,151,300,236,311]
[null,null,"Sassari",310,160,161,288,281,338,186,186,282,168,227,221]
[null,null,"Taranto",184,347,230,193,314,253,232,346,260,264,294,333]
[null,null,"Torino",336,237,210,171,319,344,170,167,158,159,323,288]
[null,null,"Trento",206,342,188,302,202,233,280,190,264,298,254,248]
[null,null,"Trieste",225,211,180,311,199,236,310,170,281,247,233,284]
[null,null,"Udine",168,221,311,238,302,291,241,152,193,210,298,244]
[null,null,"Venezia",333,214,343,276,229,260,273,165,157,244,261,243]
[null,null,"Verona",275,168,208,182,243,316,183,328,243,241,314,319]
[null,null,"Vicenza",181,239,257,255,305,255,194,298,178,274,183,291]

{"sheet":"Canapone ver2","index":3,"n_rows":40,"n_cols":18,"rows_kept":40,"cut":false,"hidden":false,"merged":[]}
[null,null,null,"RENDICONTO ORE DI STRAORDINARIO PAGATE NEL 2014 SUDDIVISE PER MESE E PER CITTA'"]
[null,null,"Città","Gennaio","Febbraio","Marzo","Aprile","Maggio","Giugno","Luglio","Agosto","Settembre","Ottobre","Novembre","Dicembre"]
[null,null,"Ancona",338,267,232,336,1,186,247,327,156,179,172,1]
[null,null,"Arezzo",257,211,319,257,309,219,323,200,225,297,238,188]
[null,null,"Bari",252,211,178,181,342,162,337,273,263,243,303,203]
[null,null,"Bergamo",154,338,233,221,217,286,204,252,315,247,350,205]
[null,null,"Bologna",318,342,268,159,195,200,266,197,187,317,346,173]
[null,null,"Brescia",238,250,179,237,235,332,285,261,179,308,299,273]
[null,null,"Cagliari",350,350,305,311,324,251,231,325,229,260,299,191]
[null,null,"Catania",350,111,232,243,311,307,234,350,298,346,350,258]
[null,null,"Cesena",339,299,337,242,238,225,323,203,246,232,232,272]
[null,null,"Ferrara",281,307,202,253,284,165,276,310,158,318,342,182]
[null,null,"Firenze",283,218,181,301,219,164,262,288,302,253,287,312,null,"Valore Max :",{"$f":"MAX(D3:O40)","v":350}]
[null,null,"Foggia",213,171,267,347,209,284,286,318,245,190,173,230]
[null,null,"Forlì",256,270,348,181,327,307,172,273,226,189,319,231,null,{"$f":"IFERROR(INDEX($C$3:$C$40,LARGE(IF($D$3:$O$40=$R$13,ROW($A$3:$A$40)-2),ROW(A1))),\"\")","v":"Padova"},{"$f":"IFERROR(SMALL(IF(INDEX($D$3:$O$40,MATCH(Q15,$C$3:$C$40,0),0)=$R$13,COLUMN($D$1:$O$1)-3),COUNTIF($Q$15:Q15,Q15)),\"\")","v":8}]
[null,null,"Livorno",160,329,335,243,208,294,181,259,328,177,197,314,null,{"$f":"IFERROR(INDEX($C$3:$C$40,LARGE(IF($D$3:$O$40=$R$13,ROW($A$3:$A$40)-2),ROW(A2))),\"\")","v":"Modena"},{"$f":"IFERROR(SMALL(IF(INDEX($D$3:$O$40,MATCH(Q16,$C$3:$C$40,0),0)=$R$13,COLUMN($D$1:$O$1)-3),COUNTIF($Q$15:Q16,Q16)),\"\")","v":4}]
[null,null,"Messina",285,321,219,267,151,282,187,289,182,186,295,347,null,{"$f":"IFERROR(INDEX($C$3:$C$40,LARGE(IF($D$3:$O$40=$R$13,ROW($A$3:$A$40)-2),ROW(A3))),\"\")","v":"Catania"},{"$f":"IFERROR(SMALL(IF(INDEX($D$3:$O$40,MATCH(Q17,$C$3:$C$40,0),0)=$R$13,COLUMN($D$1:$O$1)-3),COUNTIF($Q$15:Q17,Q17)),\"\")","v":1}]
[null,null,"Modena",261,289,236,350,330,306,330,260,151,332,305,337,null,{"$f":"IFERROR(INDEX($C$3:$C$40,LARGE(IF($D$3:$O$40=$R$13,ROW($A$3:$A$40)-2),ROW(A4))),\"\")","v":"Catania"},{"$f":"IFERROR(SMALL(IF(INDEX($D$3:$O$40,MATCH(Q18,$C$3:$C$40,0),0)=$R$13,COLUMN($D$1:$O$1)-3),COUNTIF($Q$15:Q18,Q18)),\"\")","v":8}]
[null,null,"Monza",318,333,166,277,158,280,294,159,167,312,332,314,null,{"$f":"IFERROR(INDEX($C$3:$C$40,LARGE(IF($D$3:$O$40=$R$13,ROW($A$3:$A$40)-2),ROW(A5))),\"\")","v":"Catania"},{"$f":"IFERROR(SMALL(IF(INDEX($D$3:$O$40,MATCH(Q19,$C$3:$C$40,0),0)=$R$13,COLUMN($D$1:$O$1)-3),COUNTIF($Q$15:Q19,Q19)),\"\")","v":11}]
[null,null,"Napoli",340,275,227,343,154,243,175,203,233,257,265,213,null,{"$f":"IFERROR(INDEX($C$3:$C$40,LARGE(IF($D$3:$O$40=$R$13,ROW($A$3:$A$40)-2),ROW(A6))),\"\")","v":"Cagliari"},{"$f":"IFERROR(SMALL(IF(INDEX($D$3:$O$40,MATCH(Q20,$C$3:$C$40,0),0)=$R$13,COLUMN($D$1:$O$1)-3),COUNTIF($Q$15:Q20,Q20)),\"\")","v":1}]
[null,null,"Novara",295,265,194,180,156,230,289,328,261,159,243,171,null,{"$f":"IFERROR(INDEX($C$3:$C$40,LARGE(IF($D$3:$O$40=$R$13,ROW($A$3:$A$40)-2),ROW(A7))),\"\")","v":"Cagliari"},{"$f":"IFERROR(SMALL(IF(INDEX($D$3:$O$40,MATCH(Q21,$C$3:$C$40,0),0)=$R$13,COLUMN($D$1:$O$1)-3),COUNTIF($Q$15:Q21,Q21)),\"\")","v":2}]
[null,null,"Padova",349,313,197,321,174,231,182,350,281,167,313,0,null,{"$f":"IFERROR(INDEX($C$3:$C$40,LARGE(IF($D$3:$O$40=$R$13,ROW($A$3:$A$40)-2),ROW(A8))),\"\")","v":"Bergamo"},{"$f":"IFERROR(SMALL(IF(INDEX($D$3:$O$40,MATCH(Q22,$C$3:$C$40,0),0)=$R$13,COLUMN($D$1:$O$1)-3),COUNTIF($Q$15:Q22,Q22)),\"\")","v":11}]
[null,null,"Palermo",253,215,185,282,184,324,335,290,325,291,191,272,null,{"$f":"IFERROR(INDEX($C$3:$C$40,LARGE(IF($D$3:$O$40=$R$13,ROW($A$3:$A$40)-2),ROW(A9))),\"\")","v":""},{"$f":"IFERROR(SMALL(IF(INDEX($D$3:$O$40,MATCH(Q23,$C$3:$C$40,0),0)=$R$13,COLUMN($D$1:$O$1)-3),COUNTIF($Q$15:Q23,Q23)),\"\")","v":""}]
[null,null,"Parma",215,253,291,196,329,332,245,277,157,346,205,175,null,{"$f":"IFERROR(INDEX($C$3:$C$40,LARGE(IF($D$3:$O$40=$R$13,ROW($A$3:$A$40)-2),ROW(A10))),\"\")","v":""},{"$f":"IFERROR(SMALL(IF(INDEX($D$3:$O$40,MATCH(Q24,$C$3:$C$40,0),0)=$R$13,COLUMN($D$1:$O$1)-3),COUNTIF($Q$15:Q24,Q24)),\"\")","v":""}]
[null,null,"Pescara",222,271,234,283,320,252,170,214,255,305,168,321,null,{"$f":"IFERROR(INDEX($C$3:$C$40,LARGE(IF($D$3:$O$40=$R$13,ROW($A$3:$A$40)-2),ROW(A11))),\"\")","v":""},{"$f":"IFERROR(SMALL(IF(INDEX($D$3:$O$40,MATCH(Q25,$C$3:$C$40,0),0)=$R$13,COLUMN($D$1:$O$1)-3),COUNTIF($Q$15:Q25,Q25)),\"\")","v":""}]
[null,null,"Piacenza",315,191,214,331,339,309,179,245,326,200,345,310]
[null,null,"Prato",234,164,305,328,312,206,260,202,209,316,322,155]
[null,null,"Reggio Emilia",291,274,229,221,295,186,180,250,344,180,262,321]
[null,null,"Rimini",324,193,156,266,174,160,191,178,201,349,316,248]
[null,null,"Roma",221,305,254,205,293,168,233,200,228,150,177,336]
[null,null,"Salerno",286,152,228,231,342,256,210,297,151,300,236,311]
[null,null,"Sassari",310,160,161,288,281,338,186,186,282,168,227,221]
[null,null,"Taranto",184,347,230,193,314,253,232,346,260,264,294,333]
[null,null,"Torino",336,237,210,171,319,344,170,167,158,159,323,288]
[null,null,"Trento",206,342,188,302,202,233,280,190,264,298,254,248]
[null,null,"Trieste",225,211,180,311,199,236,310,170,281,247,233,284]
[null,null,"Udine",168,221,311,238,302,291,241,152,193,210,298,244]
[null,null,"Venezia",333,214,343,276,229,260,273,165,157,244,261,243]
[null,null,"Verona",275,168,208,182,243,316,183,328,243,241,314,319]
[null,null,"Vicenza",181,239,257,255,305,255,194,298,178,274,183,291]

{"sheet":"Mister_x","index":4,"n_rows":40,"n_cols":18,"rows_kept":40,"cut":false,"hidden":false,"merged":[]}
[null,null,null,"RENDICONTO ORE DI STRAORDINARIO PAGATE NEL 2014 SUDDIVISE PER MESE E PER CITTA'"]
[null,null,"Città","Gennaio","Febbraio","Marzo","Aprile","Maggio","Giugno","Luglio","Agosto","Settembre","Ottobre","Novembre","Dicembre"]
[null,null,"Ancona",338,267,232,336,256,186,247,327,156,179,172,192]
[null,null,"Arezzo",257,211,319,257,309,219,323,200,225,297,238,188]
[null,null,"Bari",252,211,178,181,342,162,337,273,263,243,303,203]
[null,null,"Bergamo",154,338,233,221,217,286,204,252,315,247,269,205]
[null,null,"Bologna",318,342,268,159,195,200,266,197,187,317,346,173]
[null,null,"Brescia",238,250,179,237,235,332,285,261,179,308,299,273]
[null,null,"Cagliari",170,300,305,311,324,251,231,325,229,260,299,191,null,null,{"$f":"datiMax(D3:O40,\"C\",2)","v":"Max 350 IN Foggia-Ottobre   Padova-Agosto   Verona-Marzo   "}]
[null,null,"Catania",254,268,232,243,311,307,234,308,298,346,328,258]
[null,null,"Cesena",339,299,337,242,238,225,323,203,246,232,232,272]
[null,null,"Ferrara",281,307,202,253,284,165,276,310,158,318,342,182]
[null,null,"Firenze",283,218,181,301,219,164,262,288,302,253,287,312,null,"Valore Max :",350]
[null,null,"Foggia",213,171,267,347,209,284,286,318,245,350,173,230]
[null,null,"Forlì",256,270,348,181,327,307,172,273,226,189,319,231,null,"Città :","Padova"]
[null,null,"Livorno",160,329,335,243,208,294,181,259,328,270,197,314]
[null,null,"Messina",285,321,219,267,151,282,187,289,182,186,295,347,null,"Mese :","Agosto"]
[null,null,"Modena",261,289,236,318,330,306,330,260,151,332,305,337]
[null,null,"Monza",318,333,166,277,158,280,294,159,167,312,332,314]
[null,null,"Napoli",340,275,227,343,154,243,175,203,233,257,265,213]
[null,null,"Novara",295,265,194,180,156,230,289,328,261,159,243,171]
[null,null,"Padova",349,313,197,321,174,231,182,350,281,167,313,296]
[null,null,"Palermo",253,215,185,282,184,324,335,290,325,291,191,272]
[null,null,"Parma",215,253,291,196,329,332,245,277,157,346,205,175]
[null,null,"Pescara",222,271,234,283,320,252,170,214,255,305,168,321]
[null,null,"Piacenza",315,191,214,331,339,309,179,245,326,200,345,310]
[null,null,"Prato",234,164,305,328,312,206,260,202,209,316,322,155]
[null,null,"Reggio Emilia",291,274,229,221,295,186,180,250,344,180,262,321]
[null,null,"Rimini",324,193,156,266,174,160,191,178,201,349,316,248]
[null,null,"Roma",221,305,254,205,293,168,233,200,228,150,177,336]
[null,null,"Salerno",286,152,228,231,342,256,210,297,151,300,236,311]
[null,null,"Sassari",310,160,161,288,281,338,186,186,282,168,227,221]
[null,null,"Taranto",184,347,230,193,314,253,232,346,260,264,294,333]
[null,null,"Torino",336,237,210,171,319,344,170,167,158,159,323,288]
[null,null,"Trento",206,342,188,302,202,233,280,190,264,298,254,248]
[null,null,"Trieste",225,211,180,311,199,236,310,170,281,247,233,284]
[null,null,"Udine",168,221,311,238,302,291,241,152,193,210,298,244]
[null,null,"Venezia",333,214,343,276,229,260,273,165,157,244,261,243]
[null,null,"Verona",275,168,350,182,243,316,183,328,243,241,314,319]
[null,null,"Vicenza",181,239,257,255,305,255,194,298,178,274,183,291]